{"text_format":"1","workbook":"xlsx","n_sheets":4,"sheets":["wszyscy","wyjsciowy","kody kolorów","instrukcja"],"not_rendered":{"charts":0,"images":0,"macros":1,"external_links":1,"defined_names":1,"comments":0,"pivot_tables":0},"unopened":[],"bounds":{"document_bytes":16777216,"sheet_cells":100000,"rows_first":2000,"rows_last":500,"rows_between":2000,"halvings":0,"cell_chars":16384,"cell_head_chars":4096},"cells_cut":0,"cells_raw":0,"read":"whole","date_system":"1900"}

{"sheet":"wszyscy","index":0,"n_rows":2,"n_cols":12,"rows_kept":2,"cut":false,"hidden":false,"merged":[]}
["zaprosić na BNI","imie","nazwisko","email","telefon","co robi","firma","data poznania","gdzie","feedback","dopelnienie","plec"]
[null,"Grzegorz","Frątczak","grzegorz@grefekt.pl",601766774,"uczy i trenuje mądrzejszego zarządzania sobą w czasie",null,"2011-11-18","śniadaniu BNI",null,{"$f":"VLOOKUP(B2,[1]imiona!$A:$C,2,0)","v":"Grzegorzu"},{"$f":"VLOOKUP(B2,[1]imiona!$A:$C,3,0)","v":"M"}]

{"sheet":"wyjsciowy","index":1,"n_rows":1,"n_cols":11,"rows_kept":1,"cut":false,"hidden":false,"merged":[]}
["imie","nazwisko","email","telefon","co robi","firma","data poznania","gdzie","feedback","dopelnienie","plec"]

{"sheet":"kody kolorów","index":2,"n_rows":5,"n_cols":3,"rows_kept":5,"cut":false,"hidden":false,"merged":[]}
[]
["Kody kolorów…."]
["Kolor telefonu - zaproszenie na BNI",null,"Potencjalni klienci - kolor feedbacku"]
["niebieski","dzwoniony w sprawie śniadania BNI:)","zainteresowani - wysłałem zapytanie"]
["pomarańczowy","tak kiedyś, ale nie teraaz"]

{"sheet":"instrukcja","index":3,"n_rows":6,"n_cols":1,"rows_kept":6,"cut":false,"hidden":false,"merged":[]}
["Arkusz \"wszyscy\" -> dodawaj tam wszystkie nowe kontakty wg przykładu\nW kolumnie K jest dopełnienie imiona (wołacz). Dana ta jest brana z pliku imiona_general.xlsm) poprzez funkcję: =WYSZUKAJ.PIONOWO(B2;[imiona_general.xlsm]imiona!$A:$C;2;0)\n\nW kolumnie L jest płeć osoby na podstawie jej imienia. Dana ta jest brana z pliku imiona_general.xlsm) poprzez funkcję: =WYSZUKAJ.PIONOWO(B2;[imiona_general.xlsm]imiona!$A:$C;3;0)\n\nPamiętaj! Plik imiona_general.xlsm musi być w tym samym katalogu co ten plik\n\n"]
["By zrobić plik csv do wysłania przez Thunderbird'a: \n1. Z arkusza \"wszyscy\" skopiuj dane kontaktów , które chcesz zapisać do pliku csv. Zaznacz od kolumny B do L \n2. W arkuszu \"wyjsciowy\" wklej dane z arkusza \"wszyscy\". Niech będzie zaznaczona komórka A2. (wcześniej warto najpierw skasować dane, które są w tym arkuszu). Pamiętaj, by nie kasować nagłówka w arkuszu \"wyjściowy\"\n\n3. By eksportować dane do pliku csv naciśnij przycisk \"Eksportuj do CSV\""]
[]
["Plik wynikowy csv , będzie zapisany w tym samym katalogu, co ten plik."]
[]
["Może się zdarzyć, że nie ma danego imienia w bazie imion (pliku). Wtedy należy go dodać na końcu pliku z imionami."]